{"text_format":"1","workbook":"xlsx","n_sheets":8,"sheets":["Model","Sequences","Input","Results","Phases","Tools","Multiple_Comp","aux"],"not_rendered":{"charts":0,"images":1,"macros":1,"external_links":2,"defined_names":35,"comments":0,"pivot_tables":0},"unopened":[],"bounds":{"document_bytes":16777216,"sheet_cells":100000,"rows_first":2000,"rows_last":500,"rows_between":2000,"halvings":0,"cell_chars":16384,"cell_head_chars":4096},"cells_cut":0,"cells_raw":0,"read":"whole","date_system":"1900"}

{"sheet":"Model","index":0,"n_rows":2,"n_cols":1,"rows_kept":2,"cut":false,"hidden":false,"merged":[]}
[]
["Model"]

{"sheet":"Sequences","index":1,"n_rows":46,"n_cols":3,"rows_kept":46,"cut":false,"hidden":false,"merged":[[9,0,11,0]]}
[null,"TP Sequence","Set temperature, pressure, fO2 conditions"]
["T1",900]
["T2",750]
["ΔT",1]
["T unit",1]
["P1",200]
["P2",200]
["ΔP",25]
["P unit"]
["fO2",0]
[]
[]
[]
[]
[]
[]
[]
[]
[]
[]
[]
[null,"HP Sequence","Set temperature, pressure, fO2 conditions above, ΔH below (always use unconstrained fO2)"]
["H1"]
["H2"]
["ΔH",0.1]
["H unit","kJ"]
[]
[]
[]
[]
[]
[null,"TV Sequence","Set temperature, pressure, fO2 conditions above, ΔV below (always use unconstrained fO2)"]
["V1"]
["V2"]
["ΔV",0]
["V unit","cm3"]
[]
[]
[]
[]
[]
[null,"SP Sequence","Set T1, pressure, fO2 conditions above, ΔS below (always use unconstrained fO2)"]
["S1",0]
["S2"]
["ΔS",0]
["S unit","J/K"]

{"sheet":"Input","index":2,"n_rows":36,"n_cols":10,"rows_kept":36,"cut":false,"hidden":false,"merged":[[20,3,20,4],[22,3,22,4]]}
[" ","Composition",null,"System",null,"Unit",null,"System",{"$f":"SUM(I2:I4)","v":104.87072266512838}]
["SiO2",74.39,null,"P",200,null,null,"Liquid",{"$f":"Results!C2","v":103.856624580302},{"$f":"I2/I$1","v":0.99033001719588998}]
["TiO2",0.18,null,"T",800.00000000000011,null,null,"Solids",{"$f":"SUM(Results!E2:Q2)-I4","v":1.0140980848263801},{"$f":"I3/I$1","v":9.6699828041099979E-3}]
["Al2O3",13.55,null,"log fO2",0,null,null,"Water",{"$f":"IFERROR(HLOOKUP(H4,Results!1:2,2,0),0)","v":0},{"$f":"I4/I$1","v":0}]
["Fe2O3",0.36048070499610785]
["Cr2O3",null,null,null,null,null,null,"Phase","Mass","Formula"]
["FeO",0.97563549223528312,null,null,null,null,null,"liquid",103.856624580302,"SiO2 0.71 TiO2 0.00 Al2O3 0.13 Fe2O3 0.00 FeO 0.01 MgO 0.00 CaO 0.01 Na2O 0.03 K2O 0.05 H2O 0.05"]
["MnO",null,null,null,null,null,null,"orthopyroxene",1.0140980848263801,"opx Na0.00Ca0.03Fe''0.82Mg1.11Fe'''0.01Ti0.00Al0.06Si1.96O6"]
["MgO",0.5]
["NiO",null,null,null,null,null,null,"Potential Phase","Affinity (kJ)","Formula"]
["CoO",null,null,null,null,null,null,"feldspar",0.46552643467678195,"K0.00Na0.71Ca0.29Al1.29Si2.71O8"]
["CaO",1.43,null,null,null,null,null,"water",0.55054018931696191,"H2O"]
["Na2O",3.36,null,null,null,null,null,"quartz",0.71659492466936359,"SiO2"]
["K2O",5.09,null,null,null,null,null,"clinopyroxene",2.0466710630041858,"cpx Na0.00Ca0.90Fe''-0.0Mg0.80Fe'''0.33Ti0.09Al0.38Si1.56O6"]
["P2O5",null,null,null,null,null,null,"tridymite",2.8834926841499984,"SiO2"]
["H2O",5.04,null,null,null,null,null,"spinel",2.8885252148671205,"Fe''0.31Mg0.69Fe'''0.44Al1.38Cr0.17Ti0.00O4"]
["CO2",null,null,null,null,null,null,"cristobalite",2.9335327915685485,"SiO2"]
["SO3",null,null,null,null,null,null,"olivine",4.0013282122152427,"(Ca-0.0Mg-0.0Fe''-0.0Mn0.34Co0.34Ni0.34)2SiO4"]
["Cl2O-1",null,null,null,null,null,null,"rhm-oxide",4.086694809753757,"Mn0.05Fe''0.00Mg0.79Fe'''0.31Al0.00Ti0.85O3"]
["F2O-1",null,null,null,null,null,null,"garnet",10.080467763078277,"(Ca0.22Fe''0.78Mg0.00)3Al2Si3O12"]
[null,null,null,"Success: Equilibrate",null,null,null,"rutile",10.720589054282522,"TiO2"]
[null,null,null,null,null,null,null,"fayalite",10.762742041167337,"Fe2SiO4"]
[null,null,null,{"$f":"INDEX(aux!P4:P7,aux!P3)","v":"rhyolite-MELTS_v1.0.x"},null,null,null,"cummingtonite",11.570538276995448,"(Fe''0.00Mg1.00)7Si8O22(OH)2"]
[null,null,null,null,null,null,null,"sphene",13.641578481887468,"CaTiSiO5"]
[null,null,null,null,null,null,null,"corundum",14.614603982139844,"Al2O3"]
[null,null,null,null,null,null,null,"sillimanite",15.009735662062187,"Al2SiO5"]
[null,null,null,null,null,null,null,"hornblende",22.832254862170984,"NaCa2Mg3.97Fe2+0.03Al1.00Fe3+0.00Al2Si6O22(OH)2"]
[null,null,null,null,null,null,null,"ortho-oxide",25.192524618140492,"Fe''0.04Mg0.00Fe'''1.92Ti1.04O5"]
[null,null,null,null,null,null,null,"perovskite",26.767991066482615,"CaTiO3"]
[null,null,null,null,null,null,null,"muscovite",28.928949491869194,"KAl2Si3AlO10(OH)2"]
[null,null,null,null,null,null,null,"melilite",39.999371231343886,"Na0.00Ca2.00Al0.76Mg0.09Fe0.53Si1.62O7"]
[null,null,null,null,null,null,null,"nepheline",48.126648146829531,"neph Na0.20K3.74Ca0.00[]0.06Al3.94Si4.06O16"]
[null,null,null,null,null,null,null,"aenigmatite",57.061617006742864,"Na2Fe5TiSi6O20"]
[null,null,null,null,null,null,null,"alloy-solid",67.255810854724615,"solid Fe1.00Ni0.00"]
[null,null,null,null,null,null,null,"alloy-liquid",71.742744701085613,"liquid Fe1.00Ni0.00"]
[null,null,null,null,null,null,null,"aegirine",159.74281133045,"NaFeSi2O6"]

{"sheet":"Results","index":3,"n_rows":26,"n_cols":5,"rows_kept":26,"cut":false,"hidden":false,"merged":[]}
[" ","system","liquid","solids(+water)","orthopyroxene"]
["mass (g)",104.870722665128,103.856624580302,1.0140980848263801,1.0140980848263801]
["ρ (g/cm3)",2.2248451252010102,2.2170558703403298,3.47529007782886,3.47529007782886]
["G (kJ)",-1711.1483951941439,-1697.3397378125787,-13.808657381565087,-13.808657381565087]
["H (kJ)",-1420.8994086026885,-1409.2547296787272,-11.644678923961346,-11.644678923961346]
["S (J/K)",270.46450784275697,268.44803441629801,2.01647342645831,2.01647342645831]
["Cp (J/K)",141.657681911742,140.48985723454399,1.1678246771985701,1.1678246771985701]
["V (cm3)",47.136190055320803,46.8443876267132,0.29180242860760802,0.29180242860760802]
["α (1/K)",1.4168305800906498E-4,1.422955999105909E-4,4.33488857761501E-5,4.33488857761501E-5]
["β (1/bar)",1.6946248287982818E-5,1.7046293588715451E-5,8.855154485976646E-7,8.855154485976646E-7]
["SiO2",{"$f":"IF(Input!B2=\"\",IF(OR(Input!A2=\"Fe2O3\",Input!A2=\"FeO\"),0,\"\"),Input!B2/SUM(Input!B$2:B$20)*100)","v":70.93130704811874},71.121576883947,{"$f":"IF(C11=\"\",\"\",IFERROR((B11*B$2-C11*C$2)/(B$2-C$2),0))","v":51.445240360632987},51.8224921137774]
["TiO2",{"$f":"IF(Input!B3=\"\",IF(OR(Input!A3=\"Fe2O3\",Input!A3=\"FeO\"),0,\"\"),Input!B3/SUM(Input!B$2:B$20)*100)","v":0.17163106961502045},0.17315984687168701,{"$f":"IF(C12=\"\",\"\",IFERROR((B12*B$2-C12*C$2)/(B$2-C$2),0))","v":1.5064709823732826E-2},1.5977538371733699E-2]
["Al2O3",{"$f":"IF(Input!B4=\"\",IF(OR(Input!A4=\"Fe2O3\",Input!A4=\"FeO\"),0,\"\"),Input!B4/SUM(Input!B$2:B$20)*100)","v":12.920005518241821},13.0329798849778,1.3499842659986143,1.41869997065761]
["Fe2O3",{"$f":"IF(Input!B5=\"\",IF(OR(Input!A5=\"Fe2O3\",Input!A5=\"FeO\"),0,\"\"),Input!B5/SUM(Input!B$2:B$20)*100)","v":0.34372049430032581},0.29095566473962903,5.7475144435504646,0.44082432171899599]
["Cr2O3",{"$f":"IF(Input!B6=\"\",IF(OR(Input!A6=\"Fe2O3\",Input!A6=\"FeO\"),0,\"\"),Input!B6/SUM(Input!B$2:B$20)*100)","v":""},null,""]
["FeO",{"$f":"IF(Input!B7=\"\",IF(OR(Input!A7=\"Fe2O3\",Input!A7=\"FeO\"),0,\"\"),Input!B7/SUM(Input!B$2:B$20)*100)","v":0.93027423937065912},0.73354601782025297,21.077762293661401,25.8593731500541]
["MnO",{"$f":"IF(Input!B8=\"\",IF(OR(Input!A8=\"Fe2O3\",Input!A8=\"FeO\"),0,\"\"),Input!B8/SUM(Input!B$2:B$20)*100)","v":""},null,""]
["MgO",{"$f":"IF(Input!B9=\"\",IF(OR(Input!A9=\"Fe2O3\",Input!A9=\"FeO\"),0,\"\"),Input!B9/SUM(Input!B$2:B$20)*100)","v":0.4767529711528346},0.28929433798894499,19.674916521751648,19.677452156604801]
["NiO",{"$f":"IF(Input!B10=\"\",IF(OR(Input!A10=\"Fe2O3\",Input!A10=\"FeO\"),0,\"\"),Input!B10/SUM(Input!B$2:B$20)*100)","v":""},null,""]
["CoO",{"$f":"IF(Input!B11=\"\",IF(OR(Input!A11=\"Fe2O3\",Input!A11=\"FeO\"),0,\"\"),Input!B11/SUM(Input!B$2:B$20)*100)","v":""},null,""]
["CaO",{"$f":"IF(Input!B12=\"\",IF(OR(Input!A12=\"Fe2O3\",Input!A12=\"FeO\"),0,\"\"),Input!B12/SUM(Input!B$2:B$20)*100)","v":1.3635134974971068},1.3696158759941399,0.7385518275201659,0.74580374323179699]
["Na2O",{"$f":"IF(Input!B13=\"\",IF(OR(Input!A13=\"Fe2O3\",Input!A13=\"FeO\"),0,\"\"),Input!B13/SUM(Input!B$2:B$20)*100)","v":3.203779966147049},3.2350401447522801,2.3375393292439546E-3,1.9377005583440899E-2]
["K2O",{"$f":"IF(Input!B14=\"\",IF(OR(Input!A14=\"Fe2O3\",Input!A14=\"FeO\"),0,\"\"),Input!B14/SUM(Input!B$2:B$20)*100)","v":4.8533452463358566},4.9009873184010404,-2.5812762872342954E-2]
["P2O5",{"$f":"IF(Input!B15=\"\",IF(OR(Input!A15=\"Fe2O3\",Input!A15=\"FeO\"),0,\"\"),Input!B15/SUM(Input!B$2:B$20)*100)","v":""},null,""]
["H2O",{"$f":"IF(Input!B16=\"\",IF(OR(Input!A16=\"Fe2O3\",Input!A16=\"FeO\"),0,\"\"),Input!B16/SUM(Input!B$2:B$20)*100)","v":4.8056699492205732},4.8528440245070898,-2.5559199383236263E-2]
["CO2",{"$f":"IF(Input!B17=\"\",IF(OR(Input!A17=\"Fe2O3\",Input!A17=\"FeO\"),0,\"\"),Input!B17/SUM(Input!B$2:B$20)*100)","v":""},null,""]

{"sheet":"Phases","index":4,"n_rows":1,"n_cols":5,"rows_kept":1,"cut":false,"hidden":false,"merged":[]}
["Phases (check to include)",null,null,null,1]

{"sheet":"Tools","index":5,"n_rows":0,"n_cols":0,"rows_kept":0,"cut":false,"hidden":false,"merged":[]}

{"sheet":"Multiple_Comp","index":6,"n_rows":37,"n_cols":5,"rows_kept":37,"cut":false,"hidden":false,"merged":[]}
[" ","TP_Seq","HP_Seq","SP_Seq","P_Calc"]
["SiO2",74.39,74.39,74.39,74.39]
["TiO2",0.18,0.18,0.18,0.18]
["Al2O3",13.55,13.55,13.55,13.55]
["Fe2O3",0.34788665231927213,0.34788665231927213,0.34788665231927213,0.34788665231927213]
["Cr2O3"]
["FeO",0.98269200213027152,0.98269200213027152,0.98269200213027152,0.98269200213027152]
["MnO"]
["MgO",0.5,0.5,0.5,0.5]
["NiO"]
["CoO"]
["CaO",1.43,1.43,1.43,1.43]
["Na2O",3.36,3.36,3.36,3.36]
["K2O",5.09,5.09,5.09,5.09]
["P2O5"]
["H2O",5.45,5.45,8.66,10]
["CO2"]
["SO3"]
["Cl2O-1"]
["F2O-1"]
[]
["Model","rhyolite-MELTS_v1.0.x","rhyolite-MELTS_v1.0.x","rhyolite-MELTS_v1.0.x","rhyolite-MELTS_v1.0.x"]
["Calculation","TP_Sequence","HP_Sequence","SP_Sequence","QF_P_Calc"]
["T1",845,845,850,1100]
["T2",745,745,850,700]
["ΔT",1,1,1,1]
["T unit","C","C","C","C"]
["P1",200,200,400,400]
["P2",200,200,10,25]
["ΔP",25,25,5,25]
["P unit","MPa ","MPa ","MPa ","MPa "]
["fO2 offset",0,0,0,0]
["fO2 buffer","NNO","NNO","NNO","NNO"]
["fO2 constraint",true,false,false,true]
["ΔH",0.2,0.2,0.2,0.2]
["ΔV",0,0,0,0]
["ΔS",0,0,0,0]

{"sheet":"aux","index":7,"n_rows":43,"n_cols":21,"rows_kept":43,"cut":false,"hidden":true,"merged":[]}
["Input P","Input T","Input fO2","Input constraint",null,"PT_seq P","PT_seq T","PT_seq fO2","PT_seq constraint",null,"aegirine",true,null,"SiO2",null,"Model",null,"CalcType","T unit","P unit","fO2 buffers"]
[1,1,2,null,null,1,1,2,null,null,"aenigmatite",true,null,"TiO2"]
[1,1,2,true,null,1,1,2,true,null,"alloy-liquid",true,null,"Al2O3",null,1]
["MPa ","°C","log10",null,null,"MPa ","°C","log10",null,null,"alloy-solid",true,null,"Fe2O3",null,"rhyolite-MELTS_v1.0.x",null,"QF_P_Calc","C","MPa",{"$f":"RIGHT(H5,LEN(H5)-1)","v":"NNO"}]
["bar","K","ΔNNO",null,null,"bar","K","ΔNNO",null,null,"amphibole",false,null,"Cr2O3",null,"rhyolite-MELTS_v1.1.x",null,"TP_Sequence","K","bar",{"$f":"RIGHT(H6,LEN(H6)-1)","v":"QFM"}]
["kbar",null,"ΔQFM",null,null,"kbar",null,"ΔQFM",null,null,"apatite",true,null,"FeO",null,"rhyolite-MELTS_v1.2.x",null,"HP_Sequence",null,"kbar",{"$f":"RIGHT(H7,LEN(H7)-1)","v":"HM"}]
[null,null,"ΔHM",null,null,null,null,"ΔHM",null,null,"biotite",false,null,"MnO",null,"pMELTS_v5.6.1",null,"TV_Sequence",null,null,{"$f":"RIGHT(H8,LEN(H8)-1)","v":"IW"}]
[null,null,"ΔIW",null,null,null,null,"ΔIW",null,null,"clinopyroxene",true,null,"MgO",null,null,null,"SP_Sequence"]
[null,null,null,null,null,null,null,null,null,null,"corundum",true,null,"NiO",null,null,null,"Draw_Phase_Diagram"]
[null,null,null,null,null,null,null,null,null,null,"cristobalite",true,null,"CoO"]
[null,null,null,null,null,null,null,null,null,null,"cummingtonite",true,null,"CaO"]
[null,null,null,null,null,null,null,null,null,null,"fayalite",true,null,"Na2O"]
[null,null,null,null,null,null,null,null,null,null,"feldspar",true,null,"K2O"]
[null,null,null,null,null,null,null,null,null,null,"garnet",true,null,"P2O5"]
[null,null,null,null,null,null,null,null,null,null,"hornblende",true,null,"H2O"]
[null,null,null,null,null,null,null,null,null,null,"kalsilite",true,null,"CO2"]
[null,null,null,null,null,null,null,null,null,null,"leucite",false,null,"SO3"]
[null,null,null,null,null,null,null,null,null,null,"melilite",true,null,"Cl2O-1"]
[null,null,null,null,null,null,null,null,null,null,"muscovite",true,null,"F2O-1"]
[null,null,null,null,null,null,null,null,null,null,"nepheline",true]
[null,null,null,null,null,null,null,null,null,null,"olivine",true]
[null,null,null,null,null,null,null,null,null,null,"ortho-oxide",true]
[null,null,null,null,null,null,null,null,null,null,"orthopyroxene",true]
[null,null,null,null,null,null,null,null,null,null,"perovskite",true]
[null,null,null,null,null,null,null,null,null,null,"quartz",true]
[null,null,null,null,null,null,null,null,null,null,"rhm-oxide",true]
[null,null,null,null,null,null,null,null,null,null,"rutile",true]
[null,null,null,null,null,null,null,null,null,null,"sillimanite",true]
[null,null,null,null,null,null,null,null,null,null,"sphene",true]
[null,null,null,null,null,null,null,null,null,null,"spinel",true]
[null,null,null,null,null,null,null,null,null,null,"tridymite",true]
[null,null,null,null,null,null,null,null,null,null,"water",true]
[null,null,null,null,null,null,null,null,null,null,"whitlockite",true]
[null,null,null,null,null,null,null,null,null,null,"fluid",true]
[null,null,null,null,null,null,null,null,null,null,"calcite",true]
[null,null,null,null,null,null,null,null,null,null,"aragonite",true]
[null,null,null,null,null,null,null,null,null,null,"magnesite",true]
[null,null,null,null,null,null,null,null,null,null,"siderite",true]
[null,null,null,null,null,null,null,null,null,null,"dolomite",true]
[null,null,null,null,null,null,null,null,null,null,"spurrite",true]
[null,null,null,null,null,null,null,null,null,null,"tilleyite",true]
[null,null,null,null,null,null,null,null,null,null,"diamond",true]
[null,null,null,null,null,null,null,null,null,null,"graphite",true]