{"text_format":"1","workbook":"xlsx","n_sheets":8,"sheets":["Model","Sequences","Input","Results","Phases","Tools","Multiple_Comp","aux"],"not_rendered":{"charts":0,"images":1,"macros":1,"external_links":1,"defined_names":35,"comments":0,"pivot_tables":0},"unopened":[],"bounds":{"document_bytes":16777216,"sheet_cells":100000,"rows_first":2000,"rows_last":500,"rows_between":2000,"halvings":0,"cell_chars":16384,"cell_head_chars":4096},"cells_cut":0,"cells_raw":0,"read":"whole","date_system":"1900"}

{"sheet":"Model","index":0,"n_rows":2,"n_cols":1,"rows_kept":2,"cut":false,"hidden":false,"merged":[]}
[]
["Model"]

{"sheet":"Sequences","index":1,"n_rows":46,"n_cols":3,"rows_kept":46,"cut":false,"hidden":false,"merged":[[9,0,11,0]]}
[null,"TP Sequence","Set temperature, pressure, fO2 conditions"]
["T1",770]
["T2",770]
["ΔT",1]
["T unit",1]
["P1",175]
["P2",20]
["ΔP",1]
["P unit"]
["fO2",0]
[]
[]
[]
[]
[]
[]
[]
[]
[]
[]
[]
[null,"HP Sequence","Set temperature, pressure, fO2 conditions above, ΔH below (always use unconstrained fO2)"]
["H1"]
["H2"]
["ΔH",0.25]
["H unit","kJ"]
[]
[]
[]
[]
[]
[null,"TV Sequence","Set temperature, pressure, fO2 conditions above, ΔV below (always use unconstrained fO2)"]
["V1"]
["V2"]
["ΔV",0]
["V unit","cm3"]
[]
[]
[]
[]
[]
[null,"SP Sequence","Set temperature, pressure, fO2 conditions above, ΔS below (always use unconstrained fO2)"]
["S1",271.93244067088801]
["S2",271.93244067088801]
["ΔS",0]
["S unit","J/K"]

{"sheet":"Input","index":2,"n_rows":38,"n_cols":10,"rows_kept":38,"cut":false,"hidden":false,"merged":[[20,3,20,4],[22,3,22,4]]}
[" ","System",null,"System",null,"Unit",null,"System",{"$f":"SUM(B2:B18)","v":105.78091178547417}]
["SiO2",77.7,null,"P",175,null,null,"Liquid",{"$f":"Results!C2","v":33.229245635441302}]
["TiO2",0.08,null,"T",757.00000000000011,null,null,"Solids",{"$f":"SUM(Results!E2:Q2)","v":72.541666150032697}]
["Al2O3",12.5,null,"log fO2",-2.1795400776507101]
["Fe2O3",0.20848745129798316]
["Cr2O3",null,null,null,null,null,null,"Phase","Mass","Formula"]
["FeO",0.47242433417617868,null,null,null,null,null,"liquid",33.229245635441302,"SiO2 0.73 TiO2 0.00 Al2O3 0.12 Fe2O3 0.00 FeO 0.01 MgO 0.00 CaO 0.00 Na2O 0.04 K2O 0.05 H2O 0.05"]
["MnO",null,null,null,null,null,null,"feldspar",35.457671646313898,"K0.51Na0.48Ca0.02Al1.02Si2.98O8"]
["MgO",0.03,null,null,null,null,null,"quartz",23.941165068782801,"SiO2"]
["NiO",null,null,null,null,null,null,"feldspar",8.9657522120911004,"K0.15Na0.77Ca0.08Al1.08Si2.92O8"]
["CoO",null,null,null,null,null,null,"water",3.84334068621795,"H2O"]
["CaO",0.43,null,null,null,null,null,"spinel",0.33373653662692698,"Fe''1.28Mg0.03Fe'''1.30Al0.07Cr0.00Ti0.31O4"]
["Na2O",3.99]
["K2O",4.8899999999999997,null,null,null,null,null,"Potential Phase","Affinity (kJ)","Formula"]
["P2O5",null,null,null,null,null,null,"orthopyroxene",0.34667163012284435,"opx Na0.00Ca0.98Fe''-0.0Mg0.60Fe'''0.42Ti0.01Al0.44Si1.56O6"]
["H2O",5.47,null,null,null,null,null,"clinopyroxene",1.0050391772730218,"cpx Na0.00Ca0.99Fe''-0.0Mg0.61Fe'''0.40Ti0.01Al0.42Si1.58O6"]
["CO2",0.01,null,null,null,null,null,"rhm-oxide",1.0650863383375089,"Mn0.03Fe''0.00Mg0.91Fe'''0.12Al0.00Ti0.94O3"]
["SO3",null,null,null,null,null,null,"olivine",1.5275636712756355,"(Ca-0.0Mg-0.0Fe''-0.3Mn0.44Co0.44Ni0.44)2SiO4"]
["Cl2O-1",null,null,null,null,null,null,"tridymite",2.1461468469892861,"SiO2"]
["F2O-1",null,null,null,null,null,null,"cristobalite",2.2106562024166343,"SiO2"]
[null,null,null,"Success: Equilibrate",null,null,null,"fayalite",3.717656640957808,"Fe2SiO4"]
[null,null,null,null,null,null,null,"biotite",8.4970612144548934,"K(Fe''1.00Mg0.00)3AlSi3O10(OH)2"]
[null,null,null,{"$f":"INDEX(aux!P4:P7,aux!P3)","v":"rhyolite-MELTS_v1.0.x"},null,null,null,"garnet",8.7381372802333317,"(Ca0.09Fe''0.91Mg0.00)3Al2Si3O12"]
[null,null,null,null,null,null,null,"rutile",8.8393598892153236,"TiO2"]
[null,null,null,null,null,null,null,"cummingtonite",11.05019781635561,"(Fe''0.00Mg1.00)7Si8O22(OH)2"]
[null,null,null,null,null,null,null,"sillimanite",14.475602224457543,"Al2SiO5"]
[null,null,null,null,null,null,null,"corundum",14.859859548936132,"Al2O3"]
[null,null,null,null,null,null,null,"sphene",18.120156645908953,"CaTiSiO5"]
[null,null,null,null,null,null,null,"ortho-oxide",20.097068659738348,"Fe''0.02Mg0.00Fe'''1.97Ti1.02O5"]
[null,null,null,null,null,null,null,"muscovite",25.12718688635988,"KAl2Si3AlO10(OH)2"]
[null,null,null,null,null,null,null,"perovskite",32.589034166203348,"CaTiO3"]
[null,null,null,null,null,null,null,"aenigmatite",36.651886814135359,"Na2Fe5TiSi6O20"]
[null,null,null,null,null,null,null,"hornblende",36.827163174833586,"NaCa2Mg3.99Fe2+0.01Al1.00Fe3+0.00Al2Si6O22(OH)2"]
[null,null,null,null,null,null,null,"nepheline",43.510902531889137,"neph Na0.06K3.92Ca0.00[]0.02Al3.98Si4.02O16"]
[null,null,null,null,null,null,null,"melilite",45.655685581662453,"Na0.00Ca2.00Al0.69Mg0.05Fe0.60Si1.65O7"]
[null,null,null,null,null,null,null,"alloy-solid",56.73726592797879,"solid Fe1.00Ni0.00"]
[null,null,null,null,null,null,null,"alloy-liquid",61.341647491553331,"liquid Fe1.00Ni0.00"]
[null,null,null,null,null,null,null,"aegirine",142.52421260564179,"NaFeSi2O6"]

{"sheet":"Results","index":3,"n_rows":26,"n_cols":9,"rows_kept":26,"cut":false,"hidden":false,"merged":[]}
[" ","system","liquid","solids(+water)","feldspar","feldspar","quartz","spinel","water"]
["mass (g)",105.770911785474,33.229245635441302,72.541666150032796,35.457671646313898,8.9657522120911004,23.941165068782801,0.33373653662692698,3.84334068621795]
["ρ (g/cm3)",2.0593564024810802,2.2062637334164501,1.99840243918434,2.5230647957824601,2.5591217276259499,2.5406983011149902,4.9292012468835802,0.41539768157183599]
["G (kJ)",-1725.5774952822389,-539.53495582339895,-1186.0425394588401,-563.26930996392366,-145.09566963195977,-391.33769640833447,-2.2681188762072337,-84.071744578415149]
["H (kJ)",-1458.540220155882,-452.71454418767598,-1005.8256759682059,-487.20826535056574,-125.63047621542346,-342.77735772581195,-1.6562103177333896,-48.55336635867134]
["S (J/K)",259.22387469970897,84.279388084961099,174.944486614748,73.8349217233974,18.895494264462702,47.139094969201103,0.59399947432300504,34.480976183364099]
["Cp (J/K)",141.09453267481001,44.3962778633433,96.698254811467194,42.360710797282103,10.930301087291999,27.744980716184699,0.29589590028054702,15.366366310427599]
["V (cm3)",51.361149365910002,15.061320698947,36.299828666963002,14.0534130180028,3.5034489040927501,9.4230649338711991,6.7706007507388297E-2,9.2521958034888794]
["α (1/K)",3.5327994222077229E-4,1.4081973335293554E-4,4.4143273684914053E-4,2.9067735479025279E-5,3.1387221588342188E-5,0,3.2730882725321102E-5,1.6756294990118794E-3]
["β (1/bar)",8.3629931463577393E-5,1.7249727382139733E-5,1.1117203230665902E-4,1.8076181220573604E-6,1.827292104589828E-6,1.2381993090025822E-6,3.7736125187949434E-7,4.314681184223885E-4]
["SiO2",{"$f":"IF(Input!B2=\"\",IF(OR(Input!A2=\"Fe2O3\",Input!A2=\"FeO\"),0,\"\"),Input!B2/SUM(Input!B$2:B$20)*100)","v":73.453706050083184},73.284002785915604,{"$f":"IF(C11=\"\",\"\",IFERROR((B11*B$2-C11*C$2)/(B$2-C$2),0))","v":73.531442222264531},66.261096702078206,65.9450695967098,100]
["TiO2",{"$f":"IF(Input!B3=\"\",IF(OR(Input!A3=\"Fe2O3\",Input!A3=\"FeO\"),0,\"\"),Input!B3/SUM(Input!B$2:B$20)*100)","v":7.5628011377177021E-2},0.129197936158259,{"$f":"IF(C12=\"\",\"\",IFERROR((B12*B$2-C12*C$2)/(B$2-C$2),0))","v":5.1089173441733693E-2},null,null,null,11.1071148555395]
["Al2O3",{"$f":"IF(Input!B4=\"\",IF(OR(Input!A4=\"Fe2O3\",Input!A4=\"FeO\"),0,\"\"),Input!B4/SUM(Input!B$2:B$20)*100)","v":11.816876777683911},11.6031343734063,11.914786010148479,19.126590576589699,20.711539427226299,null,1.6710755046899199]
["Fe2O3",{"$f":"IF(Input!B5=\"\",IF(OR(Input!A5=\"Fe2O3\",Input!A5=\"FeO\"),0,\"\"),Input!B5/SUM(Input!B$2:B$20)*100)","v":0.19709364173453137},0.166526748716151,0.2110954540766864,null,null,null,45.890051615651799]
["Cr2O3",{"$f":"IF(Input!B6=\"\",IF(OR(Input!A6=\"Fe2O3\",Input!A6=\"FeO\"),0,\"\"),Input!B6/SUM(Input!B$2:B$20)*100)","v":""},null,""]
["FeO",{"$f":"IF(Input!B7=\"\",IF(OR(Input!A7=\"Fe2O3\",Input!A7=\"FeO\"),0,\"\"),Input!B7/SUM(Input!B$2:B$20)*100)","v":0.44660641149914154},1.01259667199966,0.18734259262653552,null,null,null,40.7345567000608]
["MnO",{"$f":"IF(Input!B8=\"\",IF(OR(Input!A8=\"Fe2O3\",Input!A8=\"FeO\"),0,\"\"),Input!B8/SUM(Input!B$2:B$20)*100)","v":""},null,""]
["MgO",{"$f":"IF(Input!B9=\"\",IF(OR(Input!A9=\"Fe2O3\",Input!A9=\"FeO\"),0,\"\"),Input!B9/SUM(Input!B$2:B$20)*100)","v":2.8360504266441381E-2},8.4283950624901002E-2,2.7435859565930112E-3,null,null,null,0.59720132405776905]
["NiO",{"$f":"IF(Input!B10=\"\",IF(OR(Input!A10=\"Fe2O3\",Input!A10=\"FeO\"),0,\"\"),Input!B10/SUM(Input!B$2:B$20)*100)","v":""},null,""]
["CoO",{"$f":"IF(Input!B11=\"\",IF(OR(Input!A11=\"Fe2O3\",Input!A11=\"FeO\"),0,\"\"),Input!B11/SUM(Input!B$2:B$20)*100)","v":""},null,""]
["CaO",{"$f":"IF(Input!B12=\"\",IF(OR(Input!A12=\"Fe2O3\",Input!A12=\"FeO\"),0,\"\"),Input!B12/SUM(Input!B$2:B$20)*100)","v":0.40650056115232652},0.495523064132111,0.36572191936487519,0.31851199809957198,1.69985163312328]
["Na2O",{"$f":"IF(Input!B13=\"\",IF(OR(Input!A13=\"Fe2O3\",Input!A13=\"FeO\"),0,\"\"),Input!B13/SUM(Input!B$2:B$20)*100)","v":3.7719470674367042},3.76759112431303,3.7739423993847079,5.4670679021595197,8.9179679118937401]
["K2O",{"$f":"IF(Input!B14=\"\",IF(OR(Input!A14=\"Fe2O3\",Input!A14=\"FeO\"),0,\"\"),Input!B14/SUM(Input!B$2:B$20)*100)","v":4.6227621954299458},4.5618793004393696,4.6506508941600577,8.8267328210728699,2.72557143104678]
["P2O5",{"$f":"IF(Input!B15=\"\",IF(OR(Input!A15=\"Fe2O3\",Input!A15=\"FeO\"),0,\"\"),Input!B15/SUM(Input!B$2:B$20)*100)","v":""},null,""]
["H2O",{"$f":"IF(Input!B16=\"\",IF(OR(Input!A16=\"Fe2O3\",Input!A16=\"FeO\"),0,\"\"),Input!B16/SUM(Input!B$2:B$20)*100)","v":5.1710652779144786},4.8952640442944402,5.2974018707294732,null,null,null,null,100]
["CO2",{"$f":"IF(Input!B17=\"\",IF(OR(Input!A17=\"Fe2O3\",Input!A17=\"FeO\"),0,\"\"),Input!B17/SUM(Input!B$2:B$20)*100)","v":9.4535014221471276E-3},null,""]

{"sheet":"Phases","index":4,"n_rows":1,"n_cols":5,"rows_kept":1,"cut":false,"hidden":false,"merged":[]}
["Phases (check to include)",null,null,null,1]

{"sheet":"Tools","index":5,"n_rows":0,"n_cols":0,"rows_kept":0,"cut":false,"hidden":false,"merged":[]}

{"sheet":"Multiple_Comp","index":6,"n_rows":20,"n_cols":12,"rows_kept":20,"cut":false,"hidden":true,"merged":[]}
[" ","UNK-202-10","UNK-202-11","UNK-202-9","UNK-202-8","UNK-202-7","UNK-202-6","UNK-202-5","UNK-202-4","UNK-202-3","UNK-202-2","UNK-202-1"]
["SiO2",75.349090909090918,75.357272727272729,75.453999999999994,75.58,75.390833333333333,75.460833333333326,75.24499999999999,75.482500000000002,75.417777777777772,75.446363636363628,75.841000000000022]
["TiO2",0.26,0.27500000000000002,0.26500000000000001,0.27500000000000002,0.26500000000000001,0.29000000000000004,0.26,0.28500000000000003,0.33499999999999996,0.31,0.28500000000000003]
["Al2O3",13.32909090909091,13.282727272727273,13.303999999999998,13.19888888888889,13.35,13.282500000000001,13.191666666666668,13.325000000000001,13.233333333333333,13.31,13.059999999999999]
["Fe2O3"]
["Cr2O3"]
["FeO",1.9463636363636363,1.9809090909090907,1.9349999999999998,1.9711111111111113,1.8983333333333334,1.8475000000000004,1.9891666666666665,1.9949999999999999,2.0277777777777781,2.0136363636363637,1.9149999999999998]
["MnO"]
["MgO",0.27500000000000002,0.27,0.27,0.26500000000000001,0.31,0.27500000000000002,0.26500000000000001,0.28500000000000003,0.29500000000000004,0.27500000000000002,0.245]
["NiO"]
["CoO"]
["CaO",1.4909090909090912,1.5127272727272727,1.4910000000000001,1.4722222222222223,1.5541666666666665,1.5533333333333335,1.5574999999999999,1.4991666666666668,1.5855555555555554,1.5545454545454547,1.423]
["Na2O",4.4772727272727275,4.5172727272727267,4.3609999999999998,4.4144444444444435,4.5308333333333337,4.4733333333333336,4.6066666666666665,4.4958333333333336,4.4577777777777774,4.2363636363636363,4.1120000000000001]
["K2O",2.958181818181818,2.8990909090909089,2.9409999999999998,2.9322222222222223,2.8966666666666661,2.9175000000000004,2.9158333333333331,2.8833333333333333,2.9000000000000004,2.916363636363636,3.0289999999999995]
["P2O5"]
["H2O",10,10,10,10,10,10,10,10,10,10,10]
["CO2"]
["SO3"]
["Cl2O-1"]
["F2O-1"]

{"sheet":"aux","index":7,"n_rows":43,"n_cols":16,"rows_kept":43,"cut":false,"hidden":false,"merged":[]}
["Input P","Input T","Input fO2","Input constraint",null,"PT_seq P","PT_seq T","PT_seq fO2","PT_seq constraint",null,"aegirine",true,null,"SiO2",null,"Model"]
[1,1,2,null,null,1,1,2,null,null,"aenigmatite",true,null,"TiO2"]
[1,1,2,false,null,1,1,2,false,null,"alloy-liquid",true,null,"Al2O3",null,1]
["MPa ","°C","log10",null,null,"MPa ","°C","log10",null,null,"alloy-solid",true,null,"Fe2O3",null,"rhyolite-MELTS_v1.0.x"]
["bar","K","ΔNNO",null,null,"bar","K","ΔNNO",null,null,"amphibole",false,null,"Cr2O3",null,"rhyolite-MELTS_v1.1.x"]
["kbar",null,"ΔQFM",null,null,"kbar",null,"ΔQFM",null,null,"apatite",true,null,"FeO",null,"rhyolite-MELTS_v1.2.x"]
[null,null,"ΔHM",null,null,null,null,"ΔHM",null,null,"biotite",true,null,"MnO",null,"pMELTS_v5.6.1"]
[null,null,"ΔIW",null,null,null,null,"ΔIW",null,null,"clinopyroxene",true,null,"MgO"]
[null,null,null,null,null,null,null,null,null,null,"corundum",true,null,"NiO"]
[null,null,null,null,null,null,null,null,null,null,"cristobalite",true,null,"CoO"]
[null,null,null,null,null,null,null,null,null,null,"cummingtonite",true,null,"CaO"]
[null,null,null,null,null,null,null,null,null,null,"fayalite",true,null,"Na2O"]
[null,null,null,null,null,null,null,null,null,null,"feldspar",true,null,"K2O"]
[null,null,null,null,null,null,null,null,null,null,"garnet",true,null,"P2O5"]
[null,null,null,null,null,null,null,null,null,null,"hornblende",true,null,"H2O"]
[null,null,null,null,null,null,null,null,null,null,"kalsilite",true,null,"CO2"]
[null,null,null,null,null,null,null,null,null,null,"leucite",false,null,"SO3"]
[null,null,null,null,null,null,null,null,null,null,"melilite",true,null,"Cl2O-1"]
[null,null,null,null,null,null,null,null,null,null,"muscovite",true,null,"F2O-1"]
[null,null,null,null,null,null,null,null,null,null,"nepheline",true]
[null,null,null,null,null,null,null,null,null,null,"olivine",true]
[null,null,null,null,null,null,null,null,null,null,"ortho-oxide",true]
[null,null,null,null,null,null,null,null,null,null,"orthopyroxene",true]
[null,null,null,null,null,null,null,null,null,null,"perovskite",true]
[null,null,null,null,null,null,null,null,null,null,"quartz",true]
[null,null,null,null,null,null,null,null,null,null,"rhm-oxide",true]
[null,null,null,null,null,null,null,null,null,null,"rutile",true]
[null,null,null,null,null,null,null,null,null,null,"sillimanite",true]
[null,null,null,null,null,null,null,null,null,null,"sphene",true]
[null,null,null,null,null,null,null,null,null,null,"spinel",true]
[null,null,null,null,null,null,null,null,null,null,"tridymite",true]
[null,null,null,null,null,null,null,null,null,null,"water",true]
[null,null,null,null,null,null,null,null,null,null,"whitlockite",true]
[null,null,null,null,null,null,null,null,null,null,"fluid",true]
[null,null,null,null,null,null,null,null,null,null,"calcite",true]
[null,null,null,null,null,null,null,null,null,null,"aragonite",true]
[null,null,null,null,null,null,null,null,null,null,"magnesite",true]
[null,null,null,null,null,null,null,null,null,null,"siderite",true]
[null,null,null,null,null,null,null,null,null,null,"dolomite",true]
[null,null,null,null,null,null,null,null,null,null,"spurrite",true]
[null,null,null,null,null,null,null,null,null,null,"tilleyite",true]
[null,null,null,null,null,null,null,null,null,null,"diamond",true]
[null,null,null,null,null,null,null,null,null,null,"graphite",true]